Quantcast

Just a note for anyone trying to compile omap3-desktop-image on Ubuntu 11.10 x64

classic Classic list List threaded Threaded
2 messages Options
Reply | Threaded
Open this post in threaded view
|  
Report Content as Inappropriate

Just a note for anyone trying to compile omap3-desktop-image on Ubuntu 11.10 x64

Stephen Farnsworth-2
I just wanted to put this out there for anyone trying to compile the omap3-desktop-image, omap3-console-image, and omap3-palmtop-image

I ran into several problems compiling the base images.  First, I had to manually download several packages (obed 0.34 and some ssl-native package and change the md5 and sha sums fin the obexd_0.34.bb).

Then I had to fix the Firefox package by copying Linux2.6.mk to Linux3.0.mk in the work directory as directed here,

I can give more details if anybody else is running into the same errors.

------------------------------------------------------------------------------
Keep Your Developer Skills Current with LearnDevNow!
The most comprehensive online learning library for Microsoft developers
is just $99.99! Visual Studio, SharePoint, SQL - plus HTML5, CSS3, MVC3,
Metro Style Apps, more. Free future releases when you subscribe now!
http://p.sf.net/sfu/learndevnow-d2d
_______________________________________________
gumstix-users mailing list
[hidden email]
https://lists.sourceforge.net/lists/listinfo/gumstix-users
Reply | Threaded
Open this post in threaded view
|  
Report Content as Inappropriate

Re: Just a note for anyone trying to compile omap3-desktop-image on Ubuntu 11.10 x64

plegal
Hi,

I'm trying to compile on ubuntu 11.10 x64.
I've already got openssl and python compiled. But I block on u-boot with following error :

| In file included from environment.c:30:0:
| /home/plegal/overo-oe/tmp/work/armv7a-angstrom-linux-gnueabi/u-boot-utils-1.2.0-r9/u-boot-1.2.0/include/environment.h:102:21: error: 'CFG_ENV_SIZE' undeclared here (not in a function)
| make[1]: *** [environment.o] Error 1
| make[1]: Leaving directory `/home/plegal/overo-oe/tmp/work/armv7a-angstrom-linux-gnueabi/u-boot-utils-1.2.0-r9/u-boot-1.2.0/tools'
| make: *** [tools] Error 2
| + die 'oe_runmake failed'
| + oefatal 'oe_runmake failed'
| + echo FATAL: 'oe_runmake failed'
| FATAL: oe_runmake failed
| + exit 1
NOTE: package u-boot-utils-1.2.0-r9: task do_compile: Failed
ERROR: Function 'do_compile' failed (see /home/plegal/overo-oe/tmp/work/armv7a-angstrom-linux-gnueabi/u-boot-utils-1.2.0-r9/temp/log.do_compile.27711 for further information)
ERROR: Task 522 (/home/plegal/overo-oe/org.openembedded.dev/recipes/u-boot/u-boot-utils_1.2.0.bb, do_compile) failed with exit code '1'
ERROR: '/home/plegal/overo-oe/org.openembedded.dev/recipes/u-boot/u-boot-utils_1.2.0.bb' failed


Any idea ?

Thks

Philippe
Loading...